Target
Eukaryotic elongation factor 2 kinase
Ligand
BDBM50314439
Substrate
Meas. Tech.
ChEMBL_624587 (CHEMBL1111547)
IC50
>10000±n/a nM
Citation
 Lockman, JWReeder, MDSuzuki, KOstanin, KHoff, RBhoite, LAustin, HBaichwal, VAdam Willardsen, J Inhibition of eEF2-K by thieno[2,3-b]pyridine analogues. Bioorg Med Chem Lett 20:2283-6 (2010)  
Target
Name:
Eukaryotic elongation factor 2 kinase
Synonyms:
Calcium/calmodulin-dependent eukaryotic elongation factor 2 kinase EF2K_HUMAN Eukaryotic elongation factor 2 kinase (eEF-2K) eEF-2 kinase | eEF-2K
Type:
Protein
Mol. Mass.:
82116.99
Organism:
Homo sapiens (Human)
Description:
Residue:
725
  
Inhibitor
Name:
BDBM50314439
Synonyms:
3-amino-6-(2,4-dimethoxybenzyl)-4-(furan-2-yl)thieno[2,3-b]pyridine-2-carboxamide | CHEMBL1092769
Type:
Small organic molecule
Emp. Form.:
C21H19N3O4S
Mol. Mass.:
409.458
SMILES:
COc1ccc(Cc2cc(-c3ccco3)c3c(N)c(sc3n2)C(N)=O)c(OC)c1
: