Target
Baculoviral IAP repeat-containing protein 7
Ligand
BDBM50314462
Substrate
Meas. Tech.
ChEMBL_624591 (CHEMBL1111551)
Ki
140000±n/a nM
Citation
 Cohen, FKoehler, MFBergeron, PElliott, LOFlygare, JAFranklin, MCGazzard, LKeteltas, SFLau, KLy, CQTsui, VFairbrother, WJ Antagonists of inhibitor of apoptosis proteins based on thiazole amide isosteres. Bioorg Med Chem Lett 20:2229-33 (2010)  
Target
Name:
Baculoviral IAP repeat-containing protein 7
Synonyms:
BIR3 BIRC7_HUMAN KIAP MLIAP | RNF50
Type:
PROTEIN
Mol. Mass.:
32792.04
Organism:
Homo sapiens (Human)
Description:
ChEMBL_624591
Residue:
298
  
Inhibitor
Name:
BDBM50314462
Synonyms:
(2S)-N-((1S)-2-((2S)-2-(5-(3-methoxyprop-1-ynyl)-4-(naphthalen-1-yl)thiazol-2-yl)pyrrolidin-1-yl)-2-oxo-1-(tetrahydro-2H-pyran-4-yl)ethyl)-2-(methylamino)propanamide | CHEMBL1093598
Type:
Small organic molecule
Emp. Form.:
C32H38N4O4S
Mol. Mass.:
574.734
SMILES:
CN[C@@H](C)C(=O)N[C@@H](C1CCOCC1)C(=O)N1CCC[C@H]1c1nc(c(s1)C#CCOC)-c1cccc2ccccc12
: