Target
Prostaglandin G/H synthase 2
Ligand
BDBM50314588
Substrate
Meas. Tech.
ChEMBL_625111 (CHEMBL1114349)
IC50
6400±n/a nM
Citation
 Yu, GPraveen Rao, PNChowdhury, MAAbdellatif, KRDong, YDas, DVelázquez, CASuresh, MRKnaus, EE Synthesis and biological evaluation of N-difluoromethyl-1,2-dihydropyrid-2-one acetic acid regioisomers: dual inhibitors of cyclooxygenases and 5-lipoxygenase. Bioorg Med Chem Lett 20:2168-73 (2010)  
Target
Name:
Prostaglandin G/H synthase 2
Synonyms:
COX2 Cyclooxygenase 2 (COX-2) Cyclooxygenase-2 (COX-2 AA) Cyclooxygenase-2 (COX-2) PGH2_HUMAN PHS II Prostaglandin E synthase/G/H synthase 2 Prostaglandin-endoperoxide synthase 2
Type:
Enzyme
Mol. Mass.:
69003.89
Organism:
Homo sapiens (Human)
Description:
Recombinant Cox-2 provided by Cayman (Cayman Chemical Co.,Ann Arbor, MI).
Residue:
604
  
Inhibitor
Name:
BDBM50314588
Synonyms:
2-(1-Difluoromethyl-2-oxo-1,2-dihydropyridin-5-yl)propanoic acid | CHEMBL1092138
Type:
Small organic molecule
Emp. Form.:
C9H9F2NO3
Mol. Mass.:
217.1695
SMILES:
CC(C(O)=O)c1ccc(=O)n(c1)C(F)F
: