Target
Serine hydrolase RBBP9
Ligand
BDBM50314725
Substrate
Meas. Tech.
ChEMBL_625879 (CHEMBL1114312)
IC50
1200±n/a nM
Citation
 Bachovchin, DAWolfe, MRMasuda, KBrown, SJSpicer, TPFernandez-Vega, VChase, PHodder, PSRosen, HCravatt, BF Oxime esters as selective, covalent inhibitors of the serine hydrolase retinoblastoma-binding protein 9 (RBBP9). Bioorg Med Chem Lett 20:2254-8 (2010)  
Target
Name:
Serine hydrolase RBBP9
Synonyms:
BOG RBBP10 RBBP9_HUMAN
Type:
PROTEIN
Mol. Mass.:
20998.17
Organism:
Homo sapiens (Human)
Description:
ChEMBL_625879
Residue:
186
  
Inhibitor
Name:
BDBM50314725
Synonyms:
4-(cinnamoyloxyimino)-2,6-dimethylcyclohexa-2,5-dienone cid_885318
Type:
Small organic molecule
Emp. Form.:
C17H15NO3
Mol. Mass.:
281.3059
SMILES:
[#6]-[#6]-1=[#6]\[#6](-[#6]=[#6](-[#6])-[#6]-1=O)=[#7]/[#8]-[#6](=O)\[#6]=[#6]\c1ccccc1
: