Target
Diacylglycerol O-acyltransferase 1
Ligand
BDBM50314732
Substrate
Meas. Tech.
ChEMBL_626141 (CHEMBL1116104)
IC50
260±n/a nM
Citation
 Nakada, YAicher, TDLe Huerou, YTurner, TPratt, SAGonzales, SSBoyd, SAMiki, HYamamoto, TYamaguchi, HKato, KKitamura, S Novel acyl coenzyme A (CoA): diacylglycerol acyltransferase-1 inhibitors: synthesis and biological activities of diacylethylenediamine derivatives. Bioorg Med Chem 18:2785-95 (2010)  
Target
Name:
Diacylglycerol O-acyltransferase 1
Synonyms:
DGAT1_MOUSE Dgat1 Diacylglycerol O-acyltransferase 1 (DGAT1) | Diglyceride acyltransferase
Type:
Enzyme
Mol. Mass.:
56810.61
Organism:
Mus musculus (mouse)
Description:
In this assay, recombinant mouse DGAT-1 containing an N-terminal His6-epitope tag was produced in the baculovirus expression system.
Residue:
498
  
Inhibitor
Name:
BDBM50314732
Synonyms:
CHEMBL1089875 | N-(2-(4-Ethoxybenzamido)ethyl)-3-methyl-1-phenyl-1H-pyrazole-4-carboxamide
Type:
Small organic molecule
Emp. Form.:
C22H24N4O3
Mol. Mass.:
392.451
SMILES:
CCOc1ccc(cc1)C(=O)NCCNC(=O)c1cn(nc1C)-c1ccccc1
: