Target
Deoxynucleoside kinase
Ligand
BDBM50314842
Substrate
Meas. Tech.
ChEMBL_627484 (CHEMBL1111770)
IC50
17000±n/a nM
Citation
 Van Poecke, SNegri, AGago, FVan Daele, ISolaroli, NKarlsson, ABalzarini, JVan Calenbergh, S 3'-[4-Aryl-(1,2,3-triazol-1-yl)]-3'-deoxythymidine analogues as potent and selective inhibitors of human mitochondrial thymidine kinase. J Med Chem 53:2902-12 (2010)  
Target
Name:
Deoxynucleoside kinase
Synonyms:
DNK_DROME Dm-dNK dnk
Type:
PROTEIN
Mol. Mass.:
29092.93
Organism:
Drosophila melanogaster
Description:
ChEMBL_627484
Residue:
250
  
Inhibitor
Name:
BDBM50314842
Synonyms:
3'-Deoxy-3'-(5-phenyl-1,2,3-triazol-1-yl)-beta-D-thymidine | CHEMBL1090869
Type:
Small organic molecule
Emp. Form.:
C18H19N5O4
Mol. Mass.:
369.3746
SMILES:
Cc1cn([C@H]2C[C@@H]([C@@H](CO)O2)n2nncc2-c2ccccc2)c(=O)[nH]c1=O
: