Target
Serine/threonine-protein kinase mTOR
Ligand
BDBM50315084
Substrate
Meas. Tech.
ChEMBL_624711 (CHEMBL1112503)
IC50
2±n/a nM
Citation
 Richard, DJVerheijen, JCYu, KZask, A Triazines incorporating (R)-3-methylmorpholine are potent inhibitors of the mammalian target of rapamycin (mTOR) with selectivity over PI3Kalpha. Bioorg Med Chem Lett 20:2654-7 (2010)  
Target
Name:
Serine/threonine-protein kinase mTOR
Synonyms:
Frap1 Mtor | Raft1
Type:
PROTEIN
Mol. Mass.:
288819.88
Organism:
Rattus norvegicus
Description:
ChEMBL_1460639
Residue:
2549
  
Inhibitor
Name:
BDBM50315084
Synonyms:
1-(4-(4,6-bis((R)-3-methylmorpholino)-1,3,5-triazin-2-yl)phenyl)-3-(4-((dimethylamino)methyl)phenyl)urea | CHEMBL1093182
Type:
Small organic molecule
Emp. Form.:
C29H38N8O3
Mol. Mass.:
546.6638
SMILES:
C[C@@H]1COCCN1c1nc(nc(n1)-c1ccc(NC(=O)Nc2ccc(CN(C)C)cc2)cc1)N1CCOC[C@H]1C
: