Target
Androgen receptor
Ligand
BDBM50315100
Substrate
Meas. Tech.
ChEMBL_624727 (CHEMBL1113403)
IC50
252000±n/a nM
Citation
 Ogawa, YAkamatsu, MHotta, YHosoda, ATamura, H Effect of essential oils, such as raspberry ketone and its derivatives, on antiandrogenic activity based on in vitro reporter gene assay. Bioorg Med Chem Lett 20:2111-4 (2010)  
Target
Name:
Androgen receptor
Synonyms:
ANDR_HUMAN Androgen Receptor Androgen receptor/Baculoviral IAP repeat-containing protein 2 Dihydrotestosterone receptor Nuclear receptor subfamily 3 group C member 4
Type:
Receptor
Mol. Mass.:
99185.27
Organism:
Homo sapiens (Human)
Description:
CHO cells were stably transfected with human AR gene.
Residue:
920
  
Inhibitor
Name:
BDBM50315100
Synonyms:
4-(4-Hydroxy-phenyl)-butan-2-one raspberryketone
Type:
Small organic molecule
Emp. Form.:
C10H12O2
Mol. Mass.:
164.2011
SMILES:
CC(=O)CCc1ccc(O)cc1
: