Target
Serine/threonine-protein kinase mTOR
Ligand
BDBM50315218
Substrate
Meas. Tech.
ChEMBL_625172 (CHEMBL1117042)
IC50
2.6±n/a nM
Citation
 Zask, AVerheijen, JCRichard, DJKaplan, JCurran, KToral-Barza, LLucas, JHollander, IYu, K Discovery of 2-ureidophenyltriazines bearing bridged morpholines as potent and selective ATP-competitive mTOR inhibitors. Bioorg Med Chem Lett 20:2644-7 (2010)  
Target
Name:
Serine/threonine-protein kinase mTOR
Synonyms:
Frap1 Mtor | Raft1
Type:
PROTEIN
Mol. Mass.:
288819.88
Organism:
Rattus norvegicus
Description:
ChEMBL_1460639
Residue:
2549
  
Inhibitor
Name:
BDBM50315218
Synonyms:
1-cyclopropyl-3-(4-(4,6-di(8-oxa-3-azabicyclo[3.2.1]octan-3-yl)-1,3,5-triazin-2-yl)phenyl)urea | CHEMBL1092909
Type:
Small organic molecule
Emp. Form.:
C25H31N7O3
Mol. Mass.:
477.5587
SMILES:
O=C(NC1CC1)Nc1ccc(cc1)-c1nc(nc(n1)N1CC2CCC(C1)O2)N1CC2CCC(C1)O2
: