Target
Calcitonin gene-related peptide type 1 receptor
Ligand
BDBM50315399
Substrate
Meas. Tech.
ChEMBL_626017 (CHEMBL1106145)
Ki
1.4±n/a nM
Citation
 Stump, CABell, IMBednar, RAFay, JFGallicchio, SNHershey, JCJelley, RKreatsoulas, CMoore, ELMosser, SDQuigley, AGRoller, SASalvatore, CASharik, SSTheberge, CRZartman, CBKane, SAGraham, SLSelnick, HGVacca, JPWilliams, TM Identification of potent, highly constrained CGRP receptor antagonists. Bioorg Med Chem Lett 20:2572-6 (2010)  
Target
Name:
Calcitonin gene-related peptide type 1 receptor
Synonyms:
Adrenomedullin receptor AM1; CALCRL/RAMP2 CALRL_HUMAN CGRP type 1 receptor mRNA Calcitonin gene-related peptide (CGRP) receptor Calcitonin receptor-like receptor Human CL receptor
Type:
Enzyme Catalytic Domain
Mol. Mass.:
52980.45
Organism:
Homo sapiens (Human)
Description:
Q16602
Residue:
461
  
Inhibitor
Name:
BDBM50315399
Synonyms:
(R)-2-((2-oxo-3,4-dihydroquinolin-1(2H)-yl)methyl)-6,8-dihydrospiro[cyclopenta[g]quinoline-7,3'-pyrrolo[2,3-b]pyridin]-2'(1'H)-one | CHEMBL1090847
Type:
Small organic molecule
Emp. Form.:
C28H22N4O2
Mol. Mass.:
446.4999
SMILES:
O=C1Nc2ncccc2[C@]11Cc2cc3ccc(CN4C(=O)CCc5ccccc45)nc3cc2C1
: