Target
Carbonic anhydrase
Ligand
BDBM50258681
Substrate
Meas. Tech.
ChEMBL_626038 (CHEMBL1106166)
Ki
53±n/a nM
Citation
 Güzel, OMaresca, AHall, RAScozzafava, AMastrolorenzo, AMühlschlegel, FASupuran, CT Carbonic anhydrase inhibitors. The beta-carbonic anhydrases from the fungal pathogens Cryptococcus neoformans and Candida albicans are strongly inhibited by substituted-phenyl-1H-indole-5-sulfonamides. Bioorg Med Chem Lett 20:2508-11 (2010)  
Target
Name:
Carbonic anhydrase
Synonyms:
CAN_CANAL beta-Carbonic Anhydrase
Type:
Enzyme
Mol. Mass.:
31587.59
Organism:
Candida albicans (Yeast)
Description:
Residue:
281
  
Inhibitor
Name:
BDBM50258681
Synonyms:
1-(3-(4-bromophenyl)-5-sulfamoyl-1H-indole-2-carboxamido)-2,4,6-trimethylpyridinium perchlorate CHEMBL511239
Type:
Small organic molecule
Emp. Form.:
C23H22BrN4O3S
Mol. Mass.:
514.414
SMILES:
Cc1cc(C)[n+](NC(=O)c2[nH]c3ccc(cc3c2-c2ccc(Br)cc2)S(N)(=O)=O)c(C)c1
: