Target
Sphingosine 1-phosphate receptor 3
Ligand
BDBM50315811
Substrate
Meas. Tech.
ChEMBL_626104 (CHEMBL1111630)
EC50
>1000±n/a nM
Citation
 Hamada, MNakamura, MKiuchi, MMarukawa, KTomatsu, AShimano, KSato, NSugahara, KAsayama, MTakagi, KAdachi, K Removal of sphingosine 1-phosphate receptor-3 (S1P(3)) agonism is essential, but inadequate to obtain immunomodulating 2-aminopropane-1,3-diol S1P(1) agonists with reduced effect on heart rate. J Med Chem 53:3154-68 (2010)  
Target
Name:
Sphingosine 1-phosphate receptor 3
Synonyms:
C9orf108 EDG3 S1P receptor 3 S1P3 S1PR3_HUMAN Sphingosine 1-phosphate receptor 3 (S1P3) | Sphingosine 1-phosphate receptor Edg-3
Type:
G Protein-Coupled Receptor (GPCR)
Mol. Mass.:
42278.13
Organism:
Homo sapiens (Human)
Description:
Q99500
Residue:
378
  
Inhibitor
Name:
BDBM50315811
Synonyms:
2-Amino-4-(3-chloro-4'-phenoxybiphenyl-4-yl)-2-(phosphoryloxymethyl)butanol | CHEMBL1093574
Type:
Small organic molecule
Emp. Form.:
C23H25ClNO6P
Mol. Mass.:
477.874
SMILES:
NC(CO)(CCc1ccc(cc1Cl)-c1ccc(Oc2ccccc2)cc1)COP(O)(O)=O
: