Target
Prostaglandin E2 receptor EP3 subtype
Ligand
BDBM50315970
Substrate
Meas. Tech.
ChEMBL_625741 (CHEMBL1104418)
Ki
15±n/a nM
Citation
 Asada, MObitsu, TKinoshita, ANakai, YNagase, TSugimoto, ITanaka, MTakizawa, HYoshikawa, KSato, KNarita, MOhuchida, SNakai, HToda, M Discovery of novel N-acylsulfonamide analogs as potent and selective EP3 receptor antagonists. Bioorg Med Chem Lett 20:2639-43 (2010)  
Target
Name:
Prostaglandin E2 receptor EP3 subtype
Synonyms:
PE2R3_MOUSE Prostaglandin E2 receptor EP3 isoform alpha Prostanoid EP3 receptor Ptgerep3
Type:
G-protein coupled receptor
Mol. Mass.:
40092.50
Organism:
Mus musculus (Mouse)
Description:
Residue:
365
  
Inhibitor
Name:
BDBM50315970
Synonyms:
CHEMBL1092267 | N-(4-((1H-pyrazol-1-yl)methyl)-2-(2-(naphthalen-2-yl)ethoxy)benzylcarbamoyl)benzenesulfonamide
Type:
Small organic molecule
Emp. Form.:
C30H28N4O4S
Mol. Mass.:
540.633
SMILES:
O=C(NCc1ccc(Cn2cccn2)cc1OCCc1ccc2ccccc2c1)NS(=O)(=O)c1ccccc1
: