Target
Sterol O-acyltransferase 1
Ligand
BDBM50316173
Substrate
Meas. Tech.
ChEMBL_623543 (CHEMBL1117065)
IC50
>1000±n/a nM
Citation
 Asano, SBan, HTsuboya, NUno, SKino, KIoriya, KKitano, MUeno, Y A novel class of antihyperlipidemic agents with low density lipoprotein receptor up-regulation via the adaptor protein autosomal recessive hypercholesterolemia. J Med Chem 53:3284-95 (2010)  
Target
Name:
Sterol O-acyltransferase 1
Synonyms:
ACAT-1 Acat SOAT1_RAT Sterol O-acyltransferase, Soat
Type:
PROTEIN
Mol. Mass.:
64165.56
Organism:
Rattus norvegicus
Description:
ChEMBL_28796
Residue:
545
  
Inhibitor
Name:
BDBM50316173
Synonyms:
CHEMBL1093917 | Phenyl{[1-(2-Methoxyphenyl)-4-(3-methoxyphenyl)piperidin-4-yl]carbonyl}sulfamate
Type:
Small organic molecule
Emp. Form.:
C26H28N2O6S
Mol. Mass.:
496.575
SMILES:
COc1cccc(c1)C1(CCN(CC1)c1ccccc1OC)C(=O)NS(=O)(=O)Oc1ccccc1
: