Target
Glutamate receptor 3
Ligand
BDBM50316373
Substrate
Meas. Tech.
ChEMBL_628141 (CHEMBL1108152)
IC50
230±n/a nM
Citation
 Fleming, JJEngland, PM Developing a complete pharmacology for AMPA receptors: a perspective on subtype-selective ligands. Bioorg Med Chem 18:1381-7 (2010)  
Target
Name:
Glutamate receptor 3
Synonyms:
AMPA-selective glutamate receptor 3 GLURC GRIA3_HUMAN GluR-C Glutamate receptor 3 Glutamate receptor ionotropic, AMPA 3
Type:
PROTEIN
Mol. Mass.:
101172.14
Organism:
Homo sapiens (Human)
Description:
ChEMBL_468627
Residue:
894
  
Inhibitor
Name:
BDBM50316373
Synonyms:
Argiotoxin-636 | CHEMBL1098240
Type:
Small organic molecule
Emp. Form.:
C29H52N10O6
Mol. Mass.:
636.7866
SMILES:
[#7]-[#6@@H](-[#6]-[#6]-[#6]\[#7]=[#6](\[#7])-[#7])-[#6](=O)-[#7]-[#6]-[#6]-[#6]-[#7]-[#6]-[#6]-[#6]-[#7]-[#6]-[#6]-[#6]-[#6]-[#6]-[#7]-[#6](=O)-[#6@H](-[#6]-[#6](-[#7])=O)-[#7]-[#6](=O)-[#6]-c1ccc(-[#8])cc1-[#8]
: