Target
Glutamate receptor 3
Ligand
BDBM50017244
Substrate
Meas. Tech.
ChEMBL_627984 (CHEMBL1105505)
EC50
202000±n/a nM
Citation
 Fleming, JJEngland, PM Developing a complete pharmacology for AMPA receptors: a perspective on subtype-selective ligands. Bioorg Med Chem 18:1381-7 (2010)  
Target
Name:
Glutamate receptor 3
Synonyms:
AMPA-selective glutamate receptor 3 GLURC GRIA3_HUMAN GluR-C Glutamate receptor 3 Glutamate receptor ionotropic, AMPA 3
Type:
PROTEIN
Mol. Mass.:
101172.14
Organism:
Homo sapiens (Human)
Description:
ChEMBL_468627
Residue:
894
  
Inhibitor
Name:
BDBM50017244
Synonyms:
(R,S)-2-amino-3-(4-bromo-3-hydroxy-5-isoxazolyl)propionic acid CHEMBL73698
Type:
Small organic molecule
Emp. Form.:
C6H7BrN2O4
Mol. Mass.:
251.035
SMILES:
NC(Cc1o[nH]c(=O)c1Br)C(O)=O
: