Target
Glutamate receptor 1
Ligand
BDBM50316377
Substrate
Meas. Tech.
ChEMBL_627978 (CHEMBL1105499)
EC50
260±n/a nM
Citation
 Fleming, JJEngland, PM Developing a complete pharmacology for AMPA receptors: a perspective on subtype-selective ligands. Bioorg Med Chem 18:1381-7 (2010)  
Target
Name:
Glutamate receptor 1
Synonyms:
AMPA-selective glutamate receptor 1 GLUR1 GRIA1_HUMAN GluR-A Glutamate AMPA 1 Glutamate receptor AMPA 1/2 Glutamate receptor ionotropic, AMPA 1
Type:
Enzyme Catalytic Domain
Mol. Mass.:
101512.92
Organism:
Homo sapiens (Human)
Description:
Glutamate AMPA 1 GRIA1 HUMAN::P42261
Residue:
906
  
Inhibitor
Name:
BDBM50316377
Synonyms:
(R,S)-6-(2-amino-2-carboxyethyl)-3-hydroxypyridazine 1-oxide | CHEMBL1094977
Type:
Small organic molecule
Emp. Form.:
C7H9N3O4
Mol. Mass.:
199.1641
SMILES:
NC(Cc1ccc(=O)[nH][n+]1[O-])C(O)=O
: