Target
Hyaluronidase-1
Ligand
BDBM50316415
Substrate
Meas. Tech.
ChEMBL_628271 (CHEMBL1111859)
IC50
102000±n/a nM
Citation
 Iwanaga, AKusano, GWarashina, TMiyase, T Phenolic constituents of the aerial parts of Cimicifuga simplex and Cimicifuga japonica. J Nat Prod 73:609-12 (2010)  
Target
Name:
Hyaluronidase-1
Synonyms:
HYAL1 Hyaluronidase Hyaluronoglucosaminidase-1 | LUCA1
Type:
Protein
Mol. Mass.:
48369.09
Organism:
Homo sapiens (Human)
Description:
Q1279
Residue:
435
  
Inhibitor
Name:
BDBM50316415
Synonyms:
CHEMBL1097937 cimicifugic acid G
Type:
Small organic molecule
Emp. Form.:
C22H22O10
Mol. Mass.:
446.4041
SMILES:
COc1ccc(\C=C\C(=O)O[C@H](C(O)=O)[C@](O)(Cc2ccc(O)cc2)C(O)=O)cc1OC
: