Target
Hyaluronidase-1
Ligand
BDBM50316416
Substrate
Meas. Tech.
ChEMBL_628271 (CHEMBL1111859)
IC50
173000±n/a nM
Citation
 Iwanaga, AKusano, GWarashina, TMiyase, T Phenolic constituents of the aerial parts of Cimicifuga simplex and Cimicifuga japonica. J Nat Prod 73:609-12 (2010)  
Target
Name:
Hyaluronidase-1
Synonyms:
HYAL1 Hyaluronidase Hyaluronoglucosaminidase-1 | LUCA1
Type:
Protein
Mol. Mass.:
48369.09
Organism:
Homo sapiens (Human)
Description:
Q1279
Residue:
435
  
Inhibitor
Name:
BDBM50316416
Synonyms:
CHEMBL1096937 | Cimicifugic acid M
Type:
Small organic molecule
Emp. Form.:
C20H18O9
Mol. Mass.:
402.3515
SMILES:
OC(=O)[C@@H](OC(=O)\C=C\c1ccc(O)c(O)c1)[C@](O)(Cc1ccccc1)C(O)=O
: