Target
cGMP-specific 3',5'-cyclic phosphodiesterase
Ligand
BDBM50316428
Substrate
Meas. Tech.
ChEMBL_628726 (CHEMBL1107382)
IC50
29000±n/a nM
Citation
 Abadi, AHGary, BDTinsley, HNPiazza, GAAbdel-Halim, M Synthesis, molecular modeling and biological evaluation of novel tadalafil analogues as phosphodiesterase 5 and colon tumor cell growth inhibitors, new stereochemical perspective. Eur J Med Chem 45:1278-86 (2010)  
Target
Name:
cGMP-specific 3',5'-cyclic phosphodiesterase
Synonyms:
3',5'-cyclic phosphodiesterase PDE5 PDE5A_HUMAN Phosphodiesterase 5 (PDE5) Phosphodiesterase 5A (PDE5A) cGMP-specific 3',5'-cyclic phosphodiesterase
Type:
Protein
Mol. Mass.:
99975.83
Organism:
Homo sapiens (Human)
Description:
O76074
Residue:
875
  
Inhibitor
Name:
BDBM50316428
Synonyms:
CHEMBL1097216 | Methyl(1R,3R)-1-(2-bromophenyl)-2-(2-chloroacetyl)-2,3,4,9-tetrahydro-1H-b-carboline-3-carboxylate
Type:
Small organic molecule
Emp. Form.:
C21H18BrClN2O3
Mol. Mass.:
461.736
SMILES:
COC(=O)[C@H]1Cc2c([nH]c3ccccc23)[C@H](N1C(=O)CCl)c1ccccc1Br
: