Target
cGMP-specific 3',5'-cyclic phosphodiesterase
Ligand
BDBM50316429
Substrate
Meas. Tech.
ChEMBL_628726 (CHEMBL1107382)
IC50
100±n/a nM
Citation
 Abadi, AHGary, BDTinsley, HNPiazza, GAAbdel-Halim, M Synthesis, molecular modeling and biological evaluation of novel tadalafil analogues as phosphodiesterase 5 and colon tumor cell growth inhibitors, new stereochemical perspective. Eur J Med Chem 45:1278-86 (2010)  
Target
Name:
cGMP-specific 3',5'-cyclic phosphodiesterase
Synonyms:
3',5'-cyclic phosphodiesterase PDE5 PDE5A_HUMAN Phosphodiesterase 5 (PDE5) Phosphodiesterase 5A (PDE5A) cGMP-specific 3',5'-cyclic phosphodiesterase
Type:
Protein
Mol. Mass.:
99975.83
Organism:
Homo sapiens (Human)
Description:
O76074
Residue:
875
  
Inhibitor
Name:
BDBM50316429
Synonyms:
(6R,12aR)-6-(2-Bromophenyl)-2-methyl-2,3,6,7,12,12ahexahydropyrazino[1',2':1,6]pyrido[3,4-b]indole-1,4-dione | CHEMBL1097584
Type:
Small organic molecule
Emp. Form.:
C21H18BrN3O2
Mol. Mass.:
424.291
SMILES:
CN1CC(=O)N2[C@H](Cc3c([nH]c4ccccc34)[C@H]2c2ccccc2Br)C1=O
: