Target
Arginase-1
Ligand
BDBM50316605
Substrate
Meas. Tech.
ChEMBL_631783 (CHEMBL1108176)
Ki
>80000000±n/a nM
Citation
 Ilies, MDi Costanzo, LNorth, MLScott, JAChristianson, DW 2-aminoimidazole amino acids as inhibitors of the binuclear manganese metalloenzyme human arginase I. J Med Chem 53:4266-76 (2010)  
Target
Name:
Arginase-1
Synonyms:
ARG1 Liver-type arginase | Type I arginase
Type:
PROTEIN
Mol. Mass.:
34737.53
Organism:
Homo sapiens (Human)
Description:
ChEMBL_978893
Residue:
322
  
Inhibitor
Name:
BDBM50316605
Synonyms:
2-amino-5-(2-aminoimidazol-4-yl)pentanoic acid | CHEMBL1099170
Type:
Small organic molecule
Emp. Form.:
C8H14N4O2
Mol. Mass.:
198.2224
SMILES:
NC(CCCc1cnc(N)[nH]1)C(O)=O
: