Target
Nitric oxide synthase, inducible
Ligand
BDBM50316605
Substrate
Meas. Tech.
ChEMBL_631957 (CHEMBL1104713)
IC50
65000±n/a nM
Citation
 Ilies, MDi Costanzo, LNorth, MLScott, JAChristianson, DW 2-aminoimidazole amino acids as inhibitors of the binuclear manganese metalloenzyme human arginase I. J Med Chem 53:4266-76 (2010)  
Target
Name:
Nitric oxide synthase, inducible
Synonyms:
Inducible NO synthase Inducible nitric oxide synthase (iNOS) MAC-NOS NOS type II Nitric Oxide Synthase, inducible Nos2
Type:
Enzyme
Mol. Mass.:
130595.79
Organism:
Mus musculus (mouse)
Description:
Recombinant enzyme overexpressed in E. coli.
Residue:
1144
  
Inhibitor
Name:
BDBM50316605
Synonyms:
2-amino-5-(2-aminoimidazol-4-yl)pentanoic acid | CHEMBL1099170
Type:
Small organic molecule
Emp. Form.:
C8H14N4O2
Mol. Mass.:
198.2224
SMILES:
NC(CCCc1cnc(N)[nH]1)C(O)=O
: