Target
Virokine/NFkB inhibitor
Ligand
BDBM50316626
Substrate
Meas. Tech.
ChEMBL_632000 (CHEMBL1108211)
IC50
3600±n/a nM
Citation
 Cheltsov, AVAoyagi, MAleshin, AYu, ECGilliland, TZhai, DBobkov, AAReed, JCLiddington, RCAbagyan, R Vaccinia virus virulence factor N1L is a novel promising target for antiviral therapeutic intervention. J Med Chem 53:3899-906 (2010)  
Target
Name:
Virokine/NFkB inhibitor
Synonyms:
N1L
Type:
PROTEIN
Mol. Mass.:
13954.85
Organism:
Vaccinia virus
Description:
ChEMBL_631987
Residue:
117
  
Inhibitor
Name:
BDBM50316626
Synonyms:
2'-methoxy-1,1'-binaphthyl-2-ol | CHEMBL1094828
Type:
Small organic molecule
Emp. Form.:
C21H16O2
Mol. Mass.:
300.3505
SMILES:
COc1ccc2ccccc2c1-c1c(O)ccc2ccccc12
: