Target
Virokine/NFkB inhibitor
Ligand
BDBM50316630
Substrate
Meas. Tech.
ChEMBL_632001 (CHEMBL1108212)
IC50
8800±n/a nM
Citation
 Cheltsov, AVAoyagi, MAleshin, AYu, ECGilliland, TZhai, DBobkov, AAReed, JCLiddington, RCAbagyan, R Vaccinia virus virulence factor N1L is a novel promising target for antiviral therapeutic intervention. J Med Chem 53:3899-906 (2010)  
Target
Name:
Virokine/NFkB inhibitor
Synonyms:
N1L
Type:
PROTEIN
Mol. Mass.:
13954.85
Organism:
Vaccinia virus
Description:
ChEMBL_631987
Residue:
117
  
Inhibitor
Name:
BDBM50316630
Synonyms:
4,4',4''-methanetriyltris(2-methoxyphenol) | CHEMBL1096784
Type:
Small organic molecule
Emp. Form.:
C22H22O6
Mol. Mass.:
382.4065
SMILES:
COc1cc(ccc1O)C(c1ccc(O)c(OC)c1)c1ccc(O)c(OC)c1
: