Target
Sphingosine 1-phosphate receptor 3
Ligand
BDBM50316757
Substrate
Meas. Tech.
ChEMBL_632482 (CHEMBL1108346)
EC50
114±n/a nM
Citation
 Bolli, MHAbele, SBinkert, CBravo, RBuchmann, SBur, DGatfield, JHess, PKohl, CMangold, CMathys, BMenyhart, KMüller, CNayler, OScherz, MSchmidt, GSippel, VSteiner, BStrasser, DTreiber, AWeller, T 2-imino-thiazolidin-4-one derivatives as potent, orally active S1P1 receptor agonists. J Med Chem 53:4198-211 (2010)  
Target
Name:
Sphingosine 1-phosphate receptor 3
Synonyms:
C9orf108 EDG3 S1P receptor 3 S1P3 S1PR3_HUMAN Sphingosine 1-phosphate receptor 3 (S1P3) | Sphingosine 1-phosphate receptor Edg-3
Type:
G Protein-Coupled Receptor (GPCR)
Mol. Mass.:
42278.13
Organism:
Homo sapiens (Human)
Description:
Q99500
Residue:
378
  
Inhibitor
Name:
BDBM50316757
Synonyms:
(Z,Z)-5-(3-Chloro-4-hydroxy-benzylidene)-2-cyclopropylimino-3-phenyl-thiazolidin-4-one | CHEMBL1098449
Type:
Small organic molecule
Emp. Form.:
C19H15ClN2O2S
Mol. Mass.:
370.853
SMILES:
Oc1ccc(\C=C2/S\C(=N/C3CC3)N(C2=O)c2ccccc2)cc1Cl
: