Target
Sphingosine 1-phosphate receptor 1
Ligand
BDBM50316725
Substrate
Meas. Tech.
ChEMBL_632481 (CHEMBL1108345)
EC50
37±n/a nM
Citation
 Bolli, MHAbele, SBinkert, CBravo, RBuchmann, SBur, DGatfield, JHess, PKohl, CMangold, CMathys, BMenyhart, KMüller, CNayler, OScherz, MSchmidt, GSippel, VSteiner, BStrasser, DTreiber, AWeller, T 2-imino-thiazolidin-4-one derivatives as potent, orally active S1P1 receptor agonists. J Med Chem 53:4198-211 (2010)  
Target
Name:
Sphingosine 1-phosphate receptor 1
Synonyms:
CHEDG1 Endothelial differentiation G-protein coupled receptor 1 S1P1 S1PR1_HUMAN Sphingosine 1-phosphate receptor Edg-1
Type:
Enzyme
Mol. Mass.:
42836.02
Organism:
Homo sapiens (Human)
Description:
P21453
Residue:
382
  
Inhibitor
Name:
BDBM50316725
Synonyms:
(Z,Z)-5-(4-Hydroxy-3-methyl-benzylidene)-2-isopropylimino-3-phenyl-thiazolidin-4-one | CHEMBL1095995
Type:
Small organic molecule
Emp. Form.:
C20H20N2O2S
Mol. Mass.:
352.45
SMILES:
CC(C)\N=C1/S\C(=C/c2ccc(O)c(C)c2)C(=O)N1c1ccccc1
: