Target
Vascular endothelial growth factor receptor 3
Ligand
BDBM50316792
Substrate
Meas. Tech.
ChEMBL_632807 (CHEMBL1105618)
IC50
3010±n/a nM
Citation
 Büttner, ACottin, TXu, JTzagkaroulaki, LGiannis, A Serotonin derivatives as a new class of non-ATP-competitive receptor tyrosine kinase inhibitors. Bioorg Med Chem 18:3387-402 (2010)  
Target
Name:
Vascular endothelial growth factor receptor 3
Synonyms:
FLT-4 Fms-like tyrosine kinase 4 VEGFR-3 VGFR3_HUMAN Vascular endothelial growth factor receptor 3 (VEGFR-3) | Vascular endothelial growth factor receptor 3 (VEGFR3)
Type:
Protein
Mol. Mass.:
152749.58
Organism:
Homo sapiens (Human)
Description:
P35916-2
Residue:
1363
  
Inhibitor
Name:
BDBM50316792
Synonyms:
2-{5-(4-Hydroxyphenethoxy)-1-[4-(3-trifluoromethylphenyl)]benzyl-1H-indole-3-yl}ethanamine hydrochloride | CHEMBL1094195
Type:
Small organic molecule
Emp. Form.:
C32H29F3N2O2
Mol. Mass.:
530.5801
SMILES:
NCCc1cn(Cc2ccc(cc2)-c2cccc(c2)C(F)(F)F)c2ccc(OCCc3ccc(O)cc3)cc12
: