Target
Adenosine kinase
Ligand
BDBM50316803
Substrate
Meas. Tech.
ChEMBL_629062 (CHEMBL1121020)
Ki
94100±n/a nM
Citation
 Kim, YARawal, RKYoo, JSharon, AJha, AKChu, CKRais, RHAl Safarjalani, ONNaguib, FNEl Kouni, MH Structure-activity relationships of carbocyclic 6-benzylthioinosine analogues as subversive substrates of Toxoplasma gondii adenosine kinase. Bioorg Med Chem 18:3403-12 (2010)  
Target
Name:
Adenosine kinase
Synonyms:
ADK_TOXGO | AK
Type:
PROTEIN
Mol. Mass.:
38353.04
Organism:
Toxoplasma gondii
Description:
ChEMBL_629062
Residue:
363
  
Inhibitor
Name:
BDBM50316803
Synonyms:
(1'R,2'S,3'R,4'R)-1-[2,3-Dihydroxy-4-(hydroxymethyl)cyclopentan-1-yl]-6-(4-nitrobenzyl-thio)purine | CHEMBL1094894
Type:
Small organic molecule
Emp. Form.:
C18H19N5O5S
Mol. Mass.:
417.439
SMILES:
OC[C@H]1C[C@H]([C@H](O)[C@@H]1O)n1cnc2c(SCc3ccc(cc3)[N+]([O-])=O)ncnc12
: