Target
Polyphenol oxidase 2
Ligand
BDBM50174839
Substrate
Meas. Tech.
ChEMBL_629403 (CHEMBL1105756)
Ki
3900±n/a nM
Citation
 Seo, WDRyu, YBCurtis-Long, MJLee, CWRyu, HWJang, KCPark, KH Evaluation of anti-pigmentary effect of synthetic sulfonylamino chalcone. Eur J Med Chem 45:2010-7 (2010)  
Target
Name:
Polyphenol oxidase 2
Synonyms:
Monophenol monooxygenase PPO2 Tyrosinase
Type:
Protein
Mol. Mass.:
63923.66
Organism:
Agaricus bisporus (Common mushroom)
Description:
O42713
Residue:
556
  
Inhibitor
Name:
BDBM50174839
Synonyms:
1-(4-aminophenyl)-3-(4-hydroxyphenyl)prop-2-en-1-one CHEMBL383563
Type:
Small organic molecule
Emp. Form.:
C15H13NO2
Mol. Mass.:
239.2692
SMILES:
Nc1ccc(cc1)C(=O)\C=C\c1ccc(O)cc1
: