Target
Polyphenol oxidase 2
Ligand
BDBM50316857
Substrate
Meas. Tech.
ChEMBL_629403 (CHEMBL1105756)
Ki
14900±n/a nM
Citation
 Seo, WDRyu, YBCurtis-Long, MJLee, CWRyu, HWJang, KCPark, KH Evaluation of anti-pigmentary effect of synthetic sulfonylamino chalcone. Eur J Med Chem 45:2010-7 (2010)  
Target
Name:
Polyphenol oxidase 2
Synonyms:
Monophenol monooxygenase PPO2 Tyrosinase
Type:
Protein
Mol. Mass.:
63923.66
Organism:
Agaricus bisporus (Common mushroom)
Description:
O42713
Residue:
556
  
Inhibitor
Name:
BDBM50316857
Synonyms:
4'-(4-Fluorobenzensulfonamide)-4-hydroxychalcone | CHEMBL1087448
Type:
Small organic molecule
Emp. Form.:
C21H16FNO4S
Mol. Mass.:
397.419
SMILES:
Oc1ccc(\C=C\C(=O)c2ccc(NS(=O)(=O)c3ccc(F)cc3)cc2)cc1
: