Target
Adenosine receptor A2a
Ligand
BDBM50316894
Substrate
Meas. Tech.
ChEMBL_629845 (CHEMBL1116482)
Ki
4.4±n/a nM
Citation
 Shook, BCRassnick, SChakravarty, DWallace, NAult, MCrooke, JBarbay, JKWang, ALeonard, KPowell, MTAlford, VHall, DRupert, KCHeintzelman, GRHansen, KBullington, JLScannevin, RHCarroll, KLampron, LWestover, LRussell, RBranum, SWells, KDamon, SYouells, SBeauchamp, DLi, XRhodes, KJackson, PF Optimization of arylindenopyrimidines as potent adenosine A(2A)/A(1) antagonists. Bioorg Med Chem Lett 20:2868-71 (2010)  
Target
Name:
Adenosine receptor A2a
Synonyms:
A2A adenosine receptor (hA2A) ADENOSINE A2 ADORA2 Adenosine A2A receptor (A2AAR)
Type:
G Protein-Coupled Receptor (GPCR)
Mol. Mass.:
44716.46
Organism:
Homo sapiens (Human)
Description:
P29274
Residue:
412
  
Inhibitor
Name:
BDBM50316894
Synonyms:
2-amino-8-(2-morpholinoethylamino)-4-phenyl-5H-indeno[1,2-d]pyrimidin-5-one | CHEMBL1095172
Type:
Small organic molecule
Emp. Form.:
C23H23N5O2
Mol. Mass.:
401.461
SMILES:
Nc1nc2-c3cc(NCCN4CCOCC4)ccc3C(=O)c2c(n1)-c1ccccc1
: