Target
Bombesin receptor subtype-3
Ligand
BDBM50313751
Substrate
Meas. Tech.
ChEMBL_630084 (CHEMBL1110004)
EC50
9.6±n/a nM
Citation
 Hadden, MGoodman, AGuo, CGuzzo, PRHenderson, AJPattamana, KRuenz, MSargent, BJSwenson, BYet, LLiu, JHe, SSebhat, IKLin, LSTamvakopoulos, CPeng, QKan, YPalyha, OKelly, TMGuan, XMMetzger, JMReitman, MLNargund, RP Synthesis and SAR of heterocyclic carboxylic acid isosteres based on 2-biarylethylimidazole as bombesin receptor subtype-3 (BRS-3) agonists for the treatment of obesity. Bioorg Med Chem Lett 20:2912-5 (2010)  
Target
Name:
Bombesin receptor subtype-3
Synonyms:
BRS3_MOUSE | Brs3
Type:
PROTEIN
Mol. Mass.:
44239.49
Organism:
Mus musculus
Description:
ChEMBL_1445902
Residue:
399
  
Inhibitor
Name:
BDBM50313751
Synonyms:
4'-(2-(4-(2,2-dimethylbutyl)-1H-imidazol-2-yl)ethyl)biphenyl-2-carboxylic acid 4'-(2-(5-(2,2-dimethylbutyl)-1H-imidazol-2-yl)ethyl)biphenyl-2-carboxylic acid | CHEMBL1089721
Type:
Small organic molecule
Emp. Form.:
C24H28N2O2
Mol. Mass.:
376.4913
SMILES:
CCC(C)(C)Cc1cnc(CCc2ccc(cc2)-c2ccccc2C(O)=O)[nH]1
: