Target
Adenosine receptor A2a
Ligand
BDBM50317020
Substrate
Meas. Tech.
ChEMBL_630130 (CHEMBL1113721)
Ki
7.9±n/a nM
Citation
 Shook, BCRassnick, SHall, DRupert, KCHeintzelman, GRHansen, KChakravarty, DBullington, JLScannevin, RHMagliaro, BWestover, LCarroll, KLampron, LRussell, RBranum, SWells, KDamon, SYouells, SLi, XOsbourne, MDemarest, KTang, YRhodes, KJackson, PF Methylene amine substituted arylindenopyrimidines as potent adenosine A(2A)/A(1) antagonists. Bioorg Med Chem Lett 20:2864-7 (2010)  
Target
Name:
Adenosine receptor A2a
Synonyms:
A2A adenosine receptor (hA2A) ADENOSINE A2 ADORA2 Adenosine A2A receptor (A2AAR)
Type:
G Protein-Coupled Receptor (GPCR)
Mol. Mass.:
44716.46
Organism:
Homo sapiens (Human)
Description:
P29274
Residue:
412
  
Inhibitor
Name:
BDBM50317020
Synonyms:
9-((4-acetylpiperazin-1-yl)methyl)-2-amino-4-phenyl-5H-indeno[1,2-d]pyrimidin-5-one | CHEMBL1087819
Type:
Small organic molecule
Emp. Form.:
C24H23N5O2
Mol. Mass.:
413.4717
SMILES:
CC(=O)N1CCN(Cc2cccc3C(=O)c4c(nc(N)nc4-c4ccccc4)-c23)CC1
: