Target
Coagulation factor X
Ligand
BDBM50317104
Substrate
Meas. Tech.
ChEMBL_630625 (CHEMBL1111059)
IC50
23±n/a nM
Citation
 Fujimoto, TImaeda, YKonishi, NHiroe, KKawamura, MTextor, GPAertgeerts, KKubo, K Discovery of a tetrahydropyrimidin-2(1H)-one derivative (TAK-442) as a potent, selective, and orally active factor Xa inhibitor. J Med Chem 53:3517-31 (2010)  
Target
Name:
Coagulation factor X
Synonyms:
Activated coagulation factor X (FXa) Coagulation factor X precursor F10 Factor X heavy chain Factor Xa Stuart-Prower factor
Type:
Enzyme
Mol. Mass.:
54726.60
Organism:
Homo sapiens (Human)
Description:
Residue:
488
  
Inhibitor
Name:
BDBM50317104
Synonyms:
1-(1-{(2S)-3-[(6-Chloronaphthalen-2-yl)sulfonyl]-2-hydroxypropanoyl}piperidin-4-yl)imidazolidin-2-one | CHEMBL1088640
Type:
Small organic molecule
Emp. Form.:
C21H24ClN3O5S
Mol. Mass.:
465.95
SMILES:
O[C@H](CS(=O)(=O)c1ccc2cc(Cl)ccc2c1)C(=O)N1CCC(CC1)N1CCNC1=O
: