Target
Anthranilate synthase component 1
Ligand
BDBM50200003
Substrate
Meas. Tech.
ChEMBL_630881 (CHEMBL1113010)
Ki
210000±n/a nM
Citation
 Ziebart, KTDixon, SMAvila, BEl-Badri, MHGuggenheim, KGKurth, MJToney, MD Targeting multiple chorismate-utilizing enzymes with a single inhibitor: validation of a three-stage design. J Med Chem 53:3718-29 (2010)  
Target
Name:
Anthranilate synthase component 1
Synonyms:
TRPE_SALTY | trpE
Type:
PROTEIN
Mol. Mass.:
57080.90
Organism:
Salmonella typhimurium
Description:
ChEMBL_630882
Residue:
520
  
Inhibitor
Name:
BDBM50200003
Synonyms:
3-(carboxymethoxy)benzoic acid | CHEMBL216545
Type:
Small organic molecule
Emp. Form.:
C9H8O5
Mol. Mass.:
196.1568
SMILES:
OC(=O)COc1cccc(c1)C(O)=O
: