Target
Anthranilate synthase component 1
Ligand
BDBM50317146
Substrate
Meas. Tech.
ChEMBL_630881 (CHEMBL1113010)
Ki
490000±n/a nM
Citation
 Ziebart, KTDixon, SMAvila, BEl-Badri, MHGuggenheim, KGKurth, MJToney, MD Targeting multiple chorismate-utilizing enzymes with a single inhibitor: validation of a three-stage design. J Med Chem 53:3718-29 (2010)  
Target
Name:
Anthranilate synthase component 1
Synonyms:
TRPE_SALTY | trpE
Type:
PROTEIN
Mol. Mass.:
57080.90
Organism:
Salmonella typhimurium
Description:
ChEMBL_630882
Residue:
520
  
Inhibitor
Name:
BDBM50317146
Synonyms:
(S)-2-(3-(4-(3-benzoylpicolinamido)-5-(1-carbamoylcyclohexylamino)-5-oxopentylcarbamoyl)phenoxy)acetic acid | CHEMBL1094068
Type:
Small organic molecule
Emp. Form.:
C34H37N5O8
Mol. Mass.:
643.6863
SMILES:
NC(=O)C1(CCCCC1)NC(=O)[C@H](CCCNC(=O)c1cccc(OCC(O)=O)c1)NC(=O)c1ncccc1C(=O)c1ccccc1
: