Target
Aminodeoxychorismate lyase
Ligand
BDBM50200013
Substrate
Meas. Tech.
ChEMBL_630879 (CHEMBL1113008)
Ki
770000±n/a nM
Citation
 Ziebart, KTDixon, SMAvila, BEl-Badri, MHGuggenheim, KGKurth, MJToney, MD Targeting multiple chorismate-utilizing enzymes with a single inhibitor: validation of a three-stage design. J Med Chem 53:3718-29 (2010)  
Target
Name:
Aminodeoxychorismate lyase
Synonyms:
PABC_ECOLI | pabC
Type:
PROTEIN
Mol. Mass.:
29714.75
Organism:
Escherichia coli (strain K12)
Description:
ChEMBL_630879
Residue:
269
  
Inhibitor
Name:
BDBM50200013
Synonyms:
2-(3-(((S)-6-((S)-1-amino-3-(3-chlorophenyl)-1-oxopropan-2-ylamino)-5-(3-hydroxy-4-methyl-2-nitrobenzamido)-6-oxohexyl)carbamoyl)phenoxy)acetic acid CHEMBL385837
Type:
Small organic molecule
Emp. Form.:
C32H34ClN5O10
Mol. Mass.:
684.093
SMILES:
Cc1ccc(C(=O)N[C@@H](CCCCNC(=O)c2cccc(OCC(O)=O)c2)C(=O)N[C@@H](Cc2cccc(Cl)c2)C(N)=O)c(c1O)[N+]([O-])=O
: