Target
Cyclin-dependent kinase 2/G1/S-specific cyclin-E1
Ligand
BDBM50317164
Substrate
Meas. Tech.
ChEMBL_631113 (CHEMBL1103822)
IC50
8.3±n/a nM
Citation
 Choi, SJLee, JEJeong, SYIm, ILee, SDLee, EJLee, SKKwon, SMAhn, SGYoon, JHHan, SYKim, JIKim, YC 5,5'-substituted indirubin-3'-oxime derivatives as potent cyclin-dependent kinase inhibitors with anticancer activity. J Med Chem 53:3696-706 (2010)  
Target
Name:
Cyclin-dependent kinase 2/G1/S-specific cyclin-E1
Synonyms:
CDK2/CycE CDK2/E Cyclin-Dependent Kinase 2 (CDK2) Cyclin-dependent kinase 2/cyclin E1
Type:
Protein
Mol. Mass.:
Description:
Components:
This complex has 2 components.
Component 1
Name:
Cyclin-dependent kinase 2
Synonyms:
CDK2 CDK2_HUMAN Cell division protein kinase 2 Protein cereblon/Cyclin-dependent kinase 2 | p33 protein kinase
Type:
Enzyme Subunit
Mol. Mass.:
33938.17
Organism:
Homo sapiens (Human)
Description:
P24941
Residue:
298
  
Component 2
Name:
G1/S-specific cyclin-E1
Synonyms:
CCNE CCNE1_HUMAN
Type:
Enzyme Subunit
Mol. Mass.:
47073.17
Organism:
Homo sapiens (Human)
Description:
Residue:
410
  
Inhibitor
Name:
BDBM50317164
Synonyms:
(2'Z,3'E)-5-Trifluoromethoxy-5'-hydroxy-indirubin-3'-oxime | CHEMBL1086683
Type:
Small organic molecule
Emp. Form.:
C17H10F3N3O4
Mol. Mass.:
377.2742
SMILES:
Oc1ccc2[nH]c(C3C(=O)Nc4ccc(OC(F)(F)F)cc34)c(N=O)c2c1
: