Target
11-beta-hydroxysteroid dehydrogenase 1
Ligand
BDBM50317218
Substrate
Meas. Tech.
ChEMBL_631345 (CHEMBL1105682)
Ki
3.6±n/a nM
Citation
 Cheng, HHoffman, JLe, PNair, SKCripps, SMatthews, JSmith, CYang, MKupchinsky, SDress, KEdwards, MCole, BWalters, ELoh, CErmolieff, JFanjul, ABhat, GBHerrera, JPauly, THosea, NPaderes, GRejto, P The development and SAR of pyrrolidine carboxamide 11beta-HSD1 inhibitors. Bioorg Med Chem Lett 20:2897-902 (2010)  
Target
Name:
11-beta-hydroxysteroid dehydrogenase 1
Synonyms:
11-DH 11-beta-Hydroxysteroid Dehydrogenase 1 (11-beta-HSD1) 11beta-HSD1A Corticosteroid 11-beta-dehydrogenase isozyme 1 (11-beta-HSD-1) Hsd11 | Hsd11b1
Type:
Enzyme
Mol. Mass.:
32369.70
Organism:
Mus musculus (mouse)
Description:
P50172
Residue:
292
  
Inhibitor
Name:
BDBM50317218
Synonyms:
(2R)-N-(adamantan-2-yl)-1-(3,3,3-trifluoropropyl)pyrrolidine-2-carboxamide | CHEMBL1097827
Type:
Small organic molecule
Emp. Form.:
C18H27F3N2O
Mol. Mass.:
344.415
SMILES:
FC(F)(F)CCN1CCC[C@@H]1C(=O)NC1C2CC3CC(C2)CC1C3
: