Target
Serine/threonine-protein kinase pim-1
Ligand
BDBM50145361
Substrate
Meas. Tech.
ChEMBL_631598 (CHEMBL1106592)
IC50
1000±n/a nM
Citation
 Sliman, FBlairvacq, MDurieu, EMeijer, LRodrigo, JDesmaële, D Identification and structure-activity relationship of 8-hydroxy-quinoline-7-carboxylic acid derivatives as inhibitors of Pim-1 kinase. Bioorg Med Chem Lett 20:2801-5 (2010)  
Target
Name:
Serine/threonine-protein kinase pim-1
Synonyms:
PIM-1 Kinase PIM1_HUMAN Serine/threonine-protein kinase (PIM1) Serine/threonine-protein kinase PIM1 | Serine/threonine-protein kinase pim-1 (PIM1)
Type:
Protein
Mol. Mass.:
35681.82
Organism:
Homo sapiens (Human)
Description:
P11309
Residue:
313
  
Inhibitor
Name:
BDBM50145361
Synonyms:
2-(3,4-Dihydroxy-5-methoxy-phenylcarbamoyl)-8-hydroxy-quinoline-7-carboxylic acid CHEMBL83746
Type:
Small organic molecule
Emp. Form.:
C18H14N2O7
Mol. Mass.:
370.313
SMILES:
COc1cc(NC(=O)c2ccc3ccc(C(O)=O)c(O)c3n2)cc(O)c1O
: