Target
Casein kinase I isoform alpha
Ligand
BDBM50145371
Substrate
Meas. Tech.
ChEMBL_631604 (CHEMBL1106598)
IC50
>10000±n/a nM
Citation
 Sliman, FBlairvacq, MDurieu, EMeijer, LRodrigo, JDesmaële, D Identification and structure-activity relationship of 8-hydroxy-quinoline-7-carboxylic acid derivatives as inhibitors of Pim-1 kinase. Bioorg Med Chem Lett 20:2801-5 (2010)  
Target
Name:
Casein kinase I isoform alpha
Synonyms:
CK1 CSNK1A1 Casein kinase 1 alpha (CK1 alpha) KC1A_HUMAN
Type:
Serine/threonine-protein kinase
Mol. Mass.:
38936.59
Organism:
Homo sapiens (Human)
Description:
P48729
Residue:
337
  
Inhibitor
Name:
BDBM50145371
Synonyms:
2-(2,4-Dihydroxy-benzylcarbamoyl)-8-hydroxy-quinoline-7-carboxylic acid CHEMBL81714
Type:
Small organic molecule
Emp. Form.:
C18H14N2O6
Mol. Mass.:
354.3136
SMILES:
OC(=O)c1ccc2ccc(nc2c1O)C(=O)NCc1ccc(O)cc1O
: