Target
Cytochrome P450 2C9
Ligand
BDBM50317628
Substrate
Meas. Tech.
ChEMBL_632905 (CHEMBL1107487)
IC50
900±n/a nM
Target
Name:
Cytochrome P450 2C9
Synonyms:
(R)-limonene 6-monooxygenase CP2C9_HUMAN CYP2C9 Cytochrome P450 2C9 (CYP2C9 ) P-450MP P450 PB-1 | S-mephenytoin 4-hydroxylase
Type:
Enzyme
Mol. Mass.:
55636.33
Organism:
Homo sapiens (Human)
Description:
P11712
Residue:
490
  
Inhibitor
Name:
BDBM50317628
Synonyms:
4-{2-(2-Carboxy-ethyl)-3-[6-(3,5-di-pyridin-4-yl-phenoxy)-hexyl]-phenoxy}-butyric acid | CHEMBL1099326
Type:
Small organic molecule
Emp. Form.:
C35H38N2O6
Mol. Mass.:
582.686
SMILES:
OC(=O)CCCOc1cccc(CCCCCCOc2cc(cc(c2)-c2ccncc2)-c2ccncc2)c1CCC(O)=O
: