Target
Leukotriene B4 receptor 1
Ligand
BDBM50317644
Substrate
Meas. Tech.
ChEMBL_632889 (CHEMBL1107471)
IC50
8.5±n/a nM
Target
Name:
Leukotriene B4 receptor 1
Synonyms:
BLT BLTR Chemoattractant receptor-like 1 GPR16 LTB4-R 1 Leukotriene B4 R1 Leukotriene B4 receptor 1 P2Y purinoceptor 7 | P2Y7
Type:
Enzyme Catalytic Domain
Mol. Mass.:
37582.68
Organism:
Homo sapiens (Human)
Description:
Q15722
Residue:
352
  
Inhibitor
Name:
BDBM50317644
Synonyms:
4-{2-(2-Carboxy-ethyl)-3-[6-(4,4''-difluoro-[1.1':3',1'']terphenyl-5'-yloxy)-hexyl]-phenoxy}-butyric acid | CHEMBL1099324
Type:
Small organic molecule
Emp. Form.:
C37H38F2O6
Mol. Mass.:
616.6908
SMILES:
OC(=O)CCCOc1cccc(CCCCCCOc2cc(cc(c2)-c2ccc(F)cc2)-c2ccc(F)cc2)c1CCC(O)=O
: