Target
Amine oxidase [flavin-containing] B
Ligand
BDBM15579
Substrate
Meas. Tech.
ChEMBL_629410 (CHEMBL1105763)
IC50
17±n/a nM
Citation
 Alcaro, SGaspar, AOrtuso, FMilhazes, NOrallo, FUriarte, EYáñez, MBorges, F Chromone-2- and -3-carboxylic acids inhibit differently monoamine oxidases A and B. Bioorg Med Chem Lett 20:2709-12 (2010)  
Target
Name:
Amine oxidase [flavin-containing] B
Synonyms:
AOFB_HUMAN MAOB Monoamine oxidase type B (MAO B) Monoamine oxidase type B (MAOB)
Type:
Protein
Mol. Mass.:
58768.76
Organism:
Homo sapiens (Human)
Description:
P27338
Residue:
520
  
Inhibitor
Name:
BDBM15579
Synonyms:
CHEMBL972 L-Deprenyl SLG US8633208, Deprenyl methyl[(2R)-1-phenylpropan-2-yl]prop-2-yn-1-ylamine
Type:
Small organic molecule
Emp. Form.:
C13H17N
Mol. Mass.:
187.2808
SMILES:
C[C@H](Cc1ccccc1)N(C)CC#C
: