Target
Voltage-dependent L-type calcium channel subunit alpha-1D
Ligand
BDBM50317806
Substrate
Meas. Tech.
ChEMBL_629724 (CHEMBL1121084)
IC50
47±n/a nM
Citation
 Chang, CCCao, SKang, SKai, LTian, XPandey, PDunne, SFLuan, CHSurmeier, DJSilverman, RB Antagonism of 4-substituted 1,4-dihydropyridine-3,5-dicarboxylates toward voltage-dependent L-type Ca2+ channels Ca V 1.3 and Ca V 1.2. Bioorg Med Chem 18:3147-58 (2010)  
Target
Name:
Voltage-dependent L-type calcium channel subunit alpha-1D
Synonyms:
CAC1D_RAT Cacn4 Cacnl1a2 Cav1.3/Cav beta3/Cav alpha2delta complex RBD Voltage-dependent L-type calcium channel subunit alpha-1D Voltage-gated calcium channel subunit alpha Cav1.3
Type:
PROTEIN
Mol. Mass.:
250148.41
Organism:
Rattus norvegicus
Description:
ChEMBL_44709
Residue:
2203
  
Inhibitor
Name:
BDBM50317806
Synonyms:
3-methyl 5-(3-methylbut-3-enyl)2,6-dimethyl-4-(3-nitrophenyl)-1,4-dihydropyridine-3,5-dicarboxylate | CHEMBL1094560
Type:
Small organic molecule
Emp. Form.:
C21H24N2O6
Mol. Mass.:
400.4251
SMILES:
COC(=O)C1C(C(C(=O)OCCC(C)=C)=C(C)N=C1C)c1cccc(c1)[N+]([O-])=O
: