Target
Bcl-2-like protein 1
Ligand
BDBM50318190
Substrate
Meas. Tech.
ChEMBL_628977 (CHEMBL1120827)
Kd
96300±n/a nM
Citation
 Feng, YDing, XChen, TChen, LLiu, FJia, XLuo, XShen, XChen, KJiang, HWang, HLiu, HLiu, D Design, synthesis, and interaction study of quinazoline-2(1H)-thione derivatives as novel potential Bcl-xL inhibitors. J Med Chem 53:3465-79 (2010)  
Target
Name:
Bcl-2-like protein 1
Synonyms:
Anti-apoptotic Bcl-2 protein Apoptosis regulator Bcl-X BCL2-like 1 isoform 1 BCL2L1 Bcl-2-like protein 1 (Bcl-XL) Bcl-xL/Bcl-2-binding component 3 Bcl2-antagonist of cell death (BAD)
Type:
Mitochondrion membrane; Single-pass membrane protein
Mol. Mass.:
26039.60
Organism:
Homo sapiens (Human)
Description:
Residue:
233
  
Inhibitor
Name:
BDBM50318190
Synonyms:
(Z)-3-((2-Methoxy-4-((7-(4-methoxyphenyl)-9-oxo-5H-benzo[h]-thiazolo[2,3-b]quinazolin-10(6H,7H,9H)-ylidene)methyl)phenoxy)-methyl)benzoic Acid | CHEMBL1098324
Type:
Small organic molecule
Emp. Form.:
C37H30N2O6S
Mol. Mass.:
630.709
SMILES:
COc1ccc(cc1)C1C2=C(N=c3s\c(=C/c4ccc(OCc5cccc(c5)C(O)=O)c(OC)c4)c(=O)n13)c1ccccc1CC2
: