Target
Phospho-N-acetylmuramoyl-pentapeptide-transferase
Ligand
BDBM50318252
Substrate
Meas. Tech.
ChEMBL_629295 (CHEMBL1103975)
IC50
740000±n/a nM
Citation
 Ii, KIchikawa, SAl-Dabbagh, BBouhss, AMatsuda, A Function-oriented synthesis of simplified caprazamycins: discovery of oxazolidine-containing uridine derivatives as antibacterial agents against drug-resistant bacteria. J Med Chem 53:3793-813 (2010)  
Target
Name:
Phospho-N-acetylmuramoyl-pentapeptide-transferase
Synonyms:
MRAY_BACSU | mraY
Type:
PROTEIN
Mol. Mass.:
35531.14
Organism:
Bacillus subtilis
Description:
ChEMBL_796247
Residue:
324
  
Inhibitor
Name:
BDBM50318252
Synonyms:
(2R,4S,5S)-2-Aminomethyl-5-[(1R,2R,3R,4R)-2,3-dihydroxy-4-(uracil-1-yl)]tetrahydrofuryl-3-palmitoyl-(1,3)-oxazolidine-4-carboxylic Acid | CHEMBL1095321
Type:
Small organic molecule
Emp. Form.:
C29H48N4O9
Mol. Mass.:
596.7128
SMILES:
CCCCCCCCCCCCCCCC(=O)N1[C@@H](CN)O[C@H]([C@H]2O[C@H]([C@H](O)[C@@H]2O)n2ccc(=O)[nH]c2=O)[C@H]1C(O)=O
: