Target
Mast/stem cell growth factor receptor Kit
Ligand
BDBM12255
Substrate
Meas. Tech.
ChEMBL_633634 (CHEMBL1117892)
IC50
200±n/a nM
Citation
 Allen, JGFotsch, CBabij, P Emerging targets in osteoporosis disease modification. J Med Chem 53:4332-53 (2010)  
Target
Name:
Mast/stem cell growth factor receptor Kit
Synonyms:
CD117 antigen KIT Mast/stem cell growth factor receptor Kit (cKIT) Proto-oncogene tyrosine-protein kinase Kit Stem cell growth factor receptor Tyrosine-protein kinase Kit c-kit v-kit Hardy-Zuckerman 4 feline sarcoma viral oncogene homolog
Type:
Protein
Mol. Mass.:
109869.37
Organism:
Homo sapiens (Human)
Description:
P10721
Residue:
976
  
Inhibitor
Name:
BDBM12255
Synonyms:
AZD0530 Compound 33 Saracatinib | med.21724, Compound 189
Type:
Small organic molecule
Emp. Form.:
C27H32ClN5O5
Mol. Mass.:
542.026
SMILES:
CN1CCN(CCOc2cc(OC3CCOCC3)c3c(Nc4c5OCOc5ccc4Cl)ncnc3c2)CC1
: