Target
Vascular endothelial growth factor receptor 2
Ligand
BDBM50318945
Substrate
Meas. Tech.
ChEMBL_635312 (CHEMBL1119625)
IC50
<50±n/a nM
Citation
 Hudkins, RLZulli, ALUnderiner, TLAngeles, TSAimone, LDMeyer, SLPauletti, DChang, HFedorov, EVAlmo, SCFedorov, AARuggeri, BA 8-THP-DHI analogs as potent Type I dual TIE-2/VEGF-R2 receptor tyrosine kinase inhibitors. Bioorg Med Chem Lett 20:3356-60 (2010)  
Target
Name:
Vascular endothelial growth factor receptor 2
Synonyms:
CD_antigen=CD309 Fetal liver kinase 1 (FLK-1) KDR Protein-tyrosine kinase receptor Flk-1 VEGFR-2 VEGFR2 Vascular Endothelial Growth Factor Receptor Kinase 2 Vascular endothelial growth factor receptor 2 (KDR) Vascular endothelial growth factor receptor 2 (VEGFR2) Vascular endothelial growth factor receptor-2 (VEGFR-2)
Type:
Receptor Tyrosine Kinase
Mol. Mass.:
151510.97
Organism:
Homo sapiens (Human)
Description:
P35968
Residue:
1356
  
Inhibitor
Name:
BDBM50318945
Synonyms:
CHEMBL1082756 | rac-9-(2-ethoxyethyl)-5-methyl-12-(tetrahydro-2H-pyran-2-yl)-5,7,8,9-tetrahydro-1H-indazolo[5,4-a]pyrrolo[3,4-c]carbazol-3(2H)-one
Type:
Small organic molecule
Emp. Form.:
C29H32N4O3
Mol. Mass.:
484.5894
SMILES:
CCOCCn1c2ccc(cc2c2c3CNC(=O)c3c3-c4cn(C)nc4CCc3c12)C1CCCCO1
: